{"text_format":"1","workbook":"xlsx","n_sheets":7,"sheets":["WRKINGCohort data&graphs","How to use this spreadsheet","Raw Scores-BOY","Raw Scores-MOY","Raw Scores-EOY","Benchmark Scores","Dropdowns"],"not_rendered":{"charts":18,"images":9,"macros":1,"external_links":0,"defined_names":52,"comments":0,"pivot_tables":0},"unopened":[],"bounds":{"document_bytes":16777216,"sheet_cells":100000,"rows_first":2000,"rows_last":500,"rows_between":2000,"halvings":0,"cell_chars":16384,"cell_head_chars":4096},"cells_cut":0,"cells_raw":0,"read":"whole","date_system":"1900"}

{"sheet":"WRKINGCohort data&graphs","index":0,"n_rows":55,"n_cols":102,"rows_kept":55,"cut":false,"hidden":true,"merged":[[17,99,17,100],[19,5,20,19],[19,21,19,32],[48,73,48,85],[48,89,48,95],[54,1,54,33],[54,36,54,67],[54,70,54,101],[39,89,39,95],[43,1,44,2],[46,0,46,33],[46,36,46,67],[46,70,46,101],[48,0,81,0],[48,5,48,17],[48,21,48,27],[48,39,48,51],[48,55,48,61],[39,0,44,0],[39,5,39,17],[39,21,39,27],[39,39,39,51],[39,55,39,61],[39,73,39,85],[20,101,21,101],[24,1,24,33],[24,36,24,67],[24,70,24,101],[37,0,37,33],[37,37,37,67],[37,71,37,101],[20,30,20,32],[20,33,21,33],[20,55,20,63],[20,64,20,66],[20,67,21,67],[20,89,20,97],[19,39,20,53],[19,55,19,66],[19,73,20,87],[19,89,19,100],[20,21,20,29],[20,98,20,100],[15,29,15,32],[15,53,15,54],[15,55,15,58],[16,91,16,92],[16,95,17,96],[16,97,16,98],[17,65,17,66],[16,41,17,41],[16,42,17,42],[16,43,17,43],[16,44,17,44],[16,53,17,54],[16,55,16,56],[16,29,16,30],[16,31,16,32],[16,39,17,39],[16,40,17,40],[16,99,16,100],[17,21,17,22],[17,23,17,24],[17,29,17,30],[17,31,17,32],[17,55,17,56],[17,57,17,58],[16,75,17,75],[16,76,17,76],[16,77,17,77],[16,78,17,78],[16,87,17,88],[16,89,16,90],[17,89,17,90],[16,57,16,58],[16,61,17,62],[16,63,16,64],[16,65,16,66],[16,73,17,73],[16,74,17,74],[17,63,17,64],[17,91,17,92],[17,97,17,98],[16,23,16,24],[16,7,17,7],[16,8,17,8],[16,9,17,9],[16,10,17,10],[16,19,17,20],[16,21,16,22],[15,19,15,20],[15,21,15,24],[15,27,15,28],[16,27,17,28],[12,0,12,33],[12,35,12,67],[12,69,12,101],[13,0,35,0],[14,5,15,5],[14,6,14,10],[14,19,14,24],[14,27,14,32],[14,39,15,39],[14,40,14,44],[14,53,14,58],[14,61,14,66],[14,73,15,73],[14,74,14,78],[14,87,14,92],[14,95,14,100],[15,61,15,62],[15,63,15,66],[15,87,15,88],[15,89,15,92],[15,95,15,96],[15,97,15,100],[16,5,17,5],[16,6,17,6],[1,0,3,1],[1,3,1,33],[1,37,1,67],[1,71,1,101],[5,0,10,0],[5,5,5,6],[5,8,5,9],[5,39,5,40],[5,42,5,43],[5,73,5,74],[9,3,9,4],[9,37,9,38],[9,71,9,72],[10,3,10,4],[10,37,10,38],[10,71,10,72],[5,76,5,77],[7,3,7,4],[7,37,7,38],[7,71,7,72],[8,3,8,4],[8,37,8,38],[8,71,8,72]]}
[]
["NLM-L3: \nSummary Scores",null,null,"PP   Beginning of Year   (BOY)",null,null,null,null,null,null,null,null,null,null,null,null,null,null,null,null,null,null,null,null,null,null,null,null,null,null,null,null,null,null,null,null,null,"PP   Middle of Year   (MOY)",null,null,null,null,null,null,null,null,null,null,null,null,null,null,null,null,null,null,null,null,null,null,null,null,null,null,null,null,null,null,null,null,null,"PP   End of Year    (EOY)"]
[]
[]
[]
["Risk Categories Distribution",null,null,null,null,"% of students",null,null,"# of students",null,null,null,null,null,null,null,null,null,null,null,null,null,null,null,null,null,null,null,null,null,null,null,null,null,null,null,null,null,null,"% of students",null,null,"# of students",null,null,null,null,null,null,null,null,null,null,null,null,null,null,null,null,null,null,null,null,null,null,null,null,null,null,null,null,null,null,"% of students",null,null,"# of students"]
[null,null,null,null,null,"Retell Score","Ques. Score",null,"Retell Score","Ques. Score",null,null,null,null,null,null,null,null,null,null,null,null,null,null,null,null,null,null,null,null,null,null,null,null,null,null,null,null,null,"Retell Score","Ques. Score",null,"Retell Score","Ques. Score",null,null,null,null,null,null,null,null,null,null,null,null,null,null,null,null,null,null,null,null,null,null,null,null,null,null,null,null,null,"Retell Score","Ques. Score",null,"Retell Score","Ques. Score"]
[null,null,null,"Advanced",null,{"$f":"IFERROR(($I$8/$E$45),\"\")","v":0},{"$f":"IFERROR(($J$8/$E$45),\"\")","v":0},null,0,0,null,null,null,null,null,null,null,null,null,null,null,null,null,null,null,null,null,null,null,null,null,null,null,null,null,null,null,"Advanced",null,{"$f":"IFERROR(($AQ$8/$AM$45),\"\")","v":""},{"$f":"IFERROR(($AR$8/$AM$45),\"\")","v":""},null,"","",null,null,null,null,null,null,null,null,null,null,null,null,null,null,null,null,null,null,null,null,null,null,null,null,null,null,null,"Advanced",null,{"$f":"IFERROR(($BY$8/$BU$45),\"\")","v":""},{"$f":"IFERROR(($BZ$8/$BU$45),\"\")","v":""},null,"",""]
{"$rows_left_out":48}
{"sheet":"How to use this spreadsheet","index":1,"n_rows":97,"n_cols":3,"rows_kept":97,"cut":false,"hidden":false,"merged":[[96,1,96,18],[0,1,0,19],[2,1,2,18],[7,1,7,18],[9,1,13,4],[31,1,31,18],[54,1,54,18]]}
[null,"DDM-3 Spreadsheet v1.1 How To Guide"]
[]
[null,"Tabs overview"]
[null,null,"Orange tabs: Enter student details & data. Data is automatically colour coded based on benchmark (BM) scores."]
[null,null,"Future spreadsheet versions will include graphs, summary data & student tracking"]
[]
[]
[null,"Spreadsheet navigation overview"]
{"$rows_left_out":90}
{"sheet":"Raw Scores-BOY","index":2,"n_rows":135,"n_cols":85,"rows_kept":135,"cut":false,"hidden":false,"merged":[[0,0,0,2],[0,10,0,43],[0,66,0,69],[1,66,1,84],[2,10,2,43],[2,45,2,47],[2,49,2,51],[2,53,2,63],[2,66,2,69],[2,71,2,73],[2,75,2,77],[2,79,2,84],[3,0,3,1],[3,6,3,9],[3,10,3,20],[3,21,3,26],[3,27,3,37],[3,79,5,79],[3,55,4,56],[3,57,4,58],[3,59,4,60],[3,61,4,62],[3,63,5,63],[3,71,5,71],[4,69,5,69],[3,72,5,72],[3,73,5,73],[3,75,5,75],[3,76,5,76],[3,77,5,77],[4,67,5,67],[4,68,5,68],[4,66,5,66],[4,1,5,1],[4,2,5,2],[4,3,5,3],[4,4,5,4],[4,5,5,5],[3,80,5,80],[3,81,4,81],[3,82,4,82],[3,83,4,83],[3,84,4,84],[4,20,5,20],[4,26,5,26],[4,27,4,32],[4,33,4,34],[4,6,5,6],[4,9,5,9],[4,7,5,7],[4,8,5,8],[4,10,4,11],[3,53,5,53],[3,54,5,54],[3,38,3,43],[3,47,5,47],[132,10,133,19],[4,37,5,37],[4,38,4,41],[4,43,5,43],[4,12,4,15],[3,46,5,46],[4,35,4,36],[3,45,5,45],[3,49,5,49],[3,50,5,50],[3,51,5,51],[4,17,4,18]]}
["Dynamic Decoding Measures-3 Scores",null,null,null,"PP","BOY"]
[null,null,null,null,null,null,null,null,null,null,null,null,null,null,null,null,null,null,null,null,"Totals not working? \nScroll to bottom…",null,null,null,null,null,"Total not working? Scroll to bottom…",null,null,null,null,null,null,null,null,null,null,"Total not working? Scroll to bottom…",null,null,null,null,null,"Total not working? Scroll to bottom…",null,null,null,null,null,null,null,null,null,null,null,null,null,null,null,null,null,null,null,"Total not working? Scroll to bottom…",null,null,"Interpretations Summary"]
[null,null,null,null,null,null,null,null,null,null,"Phonemic Awareness",null,null,null,null,null,null,null,null,null,null,null,null,null,null,null,null,null,null,null,null,null,null,null,null,null,null,null,null,null,null,null,null,null,null,"Ortho. Mapping",null,null,null,"Not on test form (no BMs) - Phoneme Manipulation",null,null,null,"Not on test form (no BMs) - Decoding Inventory",null,null,null,null,null,null,null,null,null,null,null,null,"Phonemic Awareness",null,null,null,null,"Orthographic Mapping",null,null,null,"Phoneme Manipulation",null,null,null,"Decoding Inventory"]
[null,null,"Student Details",null,null,null,"  Assessment details",null,null,null,"Phoneme Segmentation",null,null,null,null,null,null,null,null,null,null,"(No BMs available) - Phoneme Blending",null,null,null,null,null,"First Sounds",null,null,null,null,null,null,null,null,null,null,"Continuous Blending",null,null,null,null,null,null,"Letter Names \n(/52)","Letter Sounds\n(/61)"," Irregular Words (/54)",null,"Phoneme Deletion\n(/5)","Phoneme Addition\n(/5)","Phoneme Substitution\n(/5)",null,"Closed Syllables","Vowel- \nConsonant -E","Basic Affixes",null,"Vowel Teams",null,"Vowel-R-Controlled",null,"Advanced Affixes",null,"Decoding Total Targets^ (not benchmarked)",null,null,null,null,null,null,null,"Irregular \nWords","Letter \nSounds","Letter \nNames",null,"Phoneme \nDeletion","Phoneme \nAddition","Phoneme \nSubstitution",null,"Closed Syllables","Vowel- \nConsonant -E","Basic Affixes","Vowel Teams","Vowel-R -Controlled","Advances Affixes"]
[null,"First Name","Last Name","Year\ngroup^","Class","Optional other details \n(e.g. EALD. Intervention)","Test type done\nBenchmark (BM) or Progress Monitoring (PM)?","Date of Assessment","Comments","Test Used^","CV \n(max. score of 2 sounds)",null,"CVC\n(max. score of 3 sounds)",null,null,null,"CVCC  (max. of 4)","CCVC\n(max. score of 4 sounds)",null,"CVCC  (max. of 4)","Phoneme Segmentation Total^ \n(/32 sounds)","CVC","CCV","CVC","CCVC","Two Syllables","Phoneme Blending Total^  \n(/5)\nColour = %, not BM","CVC",null,null,null,null,null,"CVCC",null,"CCVC",null,"First Sounds Total^ \n(/20)","CVC ",null,null,null,"CCV ","Continuous Blending Total (/10)",null,null,null,null,null,null,null,null,null,null,null,null,null,null,null,null,null,null,null,null,null,null,"Phoneme Segmentation Total^","Phoneme Blending Total^","First Sounds Total^","Continuous Blending Total"]
["#",null,null,null,null,null,null,null,null,null,"so","key","pain","dog","bought","gas","last","spice","blame","pest",null,"red","glue","soap","brad","chapter",null,"boat","jet","cut","rot","net","pail","last","dump","stop","grub",null,"ran","sin","moose","main","snow",null,null,null,null,null,null,null,null,null,null,null,null,"Whole word","Correct Targets","Whole word","Correct Targets","Whole word","Correct Targets","Whole word","Correct Targets",null,null,null,null,null,null,null,null,null,null,null,null,null,null,null,null,null,null,"Correct Targets","Correct Targets","Correct Targets","Correct Targets"]
["#","First Name","Last Name","Year group","Class","Optional other details","Test type done","Date of Assessment","Comments","Test Used^","so","key","pain","dog","bought","gas","last","spice","blame","pest","Phoneme Segmentation Total^","red","glue","soap","brad","chapter","Phoneme Blending Total^","boat","jet","cut","rot","net","pail","last","dump","stop","grub","First Sounds Total","ran","sin","moose","main","snow","Continuous Blending Total",null,"Letter Names","Letter Sounds","Irregular Words",null,"Phoneme Deletion","Phoneme Addition","Phoneme Substitution",null,"Closed Syllables","Vowel- \nConsonant -E","Basic Affixes - WC","Basic Affixes - CT","Vowel Teams - WC","Vowel Teams - CT","Vowel R-Controlled - WC","Vowel R-Controlled - CT","Advanced Affixes - WC","Advanced Affixes - CT","Decoding Total Targets"]
[1,null,null,{"$f":"IF(B8=\"\",\"\",$E$1)","v":""},null,null,{"$f":"IF(COUNTA(B8)=0,\"\",Dropdowns!$C$2)","v":""},null,null,{"$f":"IF(B8=\"\",\"\",IF(G8=\"PM\",\"\",$F$1))","v":""},null,null,null,null,null,null,null,null,null,null,{"$f":"IF(COUNTA(K8:T8)>0,SUM(K8:T8),\"\")","v":""},null,null,null,null,null,{"$f":"IF(COUNTA(V8:Z8)>0,SUM(V8:Z8),\"\")","v":""},null,null,null,null,null,null,null,null,null,null,{"$f":"IF(COUNTA(AB8:AK8)>0,SUM(AB8:AK8),\"\")","v":""},null,null,null,null,null,{"$f":"IF(COUNTA(AM8:AQ8)>0,SUM(AM8:AQ8),\"\")","v":""},null,null,null,null,null,null,null,null,null,null,null,null,null,null,null,null,null,null,null,{"$f":"IF(COUNTA(BB8:BK8)>1,SUM(BB8,BC8,BE8,BG8,BI8,BK8),\"\")","v":""}]
{"$rows_left_out":128}
{"sheet":"Raw Scores-MOY","index":3,"n_rows":135,"n_cols":85,"rows_kept":135,"cut":false,"hidden":false,"merged":[[3,53,5,53],[3,54,5,54],[3,42,3,47],[3,10,5,10],[132,14,133,23],[4,41,5,41],[4,42,4,45],[4,47,5,47],[4,16,4,19],[3,11,5,11],[4,39,4,40],[3,12,5,12],[3,49,5,49],[3,50,5,50],[3,51,5,51],[4,21,4,22],[4,24,5,24],[4,30,5,30],[4,31,4,36],[4,37,4,38],[4,6,5,6],[4,9,5,9],[4,7,5,7],[4,8,5,8],[4,14,4,15],[3,80,5,80],[3,81,4,81],[3,82,4,82],[3,83,4,83],[3,84,4,84],[4,1,5,1],[4,2,5,2],[4,3,5,3],[4,4,5,4],[4,5,5,5],[3,79,5,79],[3,55,4,56],[3,57,4,58],[3,59,4,60],[3,61,4,62],[3,63,5,63],[3,71,5,71],[4,69,5,69],[3,72,5,72],[3,73,5,73],[3,75,5,75],[3,76,5,76],[3,77,5,77],[4,67,5,67],[4,68,5,68],[4,66,5,66],[3,0,3,1],[3,6,3,9],[3,14,3,24],[3,25,3,30],[3,31,3,41],[0,0,0,2],[0,66,0,69],[1,66,1,84],[2,14,2,47],[2,10,2,12],[2,49,2,51],[2,53,2,63],[2,66,2,69],[2,71,2,73],[2,75,2,77],[2,79,2,84]]}
["Dynamic Decoding Measures-3 Scores",null,null,null,{"$f":"'Raw Scores-BOY'!E1","v":"PP"},"MOY"]
[null,null,null,null,null,null,null,null,null,null,null,null,null,null,null,null,null,null,null,null,null,null,null,null,"Totals not working? \nScroll to bottom…",null,null,null,null,null,"Total not working? Scroll to bottom…",null,null,null,null,null,null,null,null,null,null,"Total not working? Scroll to bottom…",null,null,null,null,null,"Total not working? Scroll to bottom…",null,null,null,null,null,null,null,null,null,null,null,null,null,null,null,null,null,null,"Interpretations Summary"]
[null,null,null,null,null,null,null,null,null,null,"OM - Orthographic Mapping",null,null,null,"Phonemic Awareness",null,null,null,null,null,null,null,null,null,null,null,null,null,null,null,null,null,null,null,null,null,null,null,null,null,null,null,null,null,null,null,null,null,null,"Phoneme Manipulation",null,null,null,"Decoding Inventory",null,null,null,null,null,null,null,null,null,null,null,null,"Phonemic Awareness",null,null,null,null,"Orthographic Mapping",null,null,null,"Phoneme Manipulation",null,null,null,"Decoding Inventory"]
[null,null,"Student Details",null,null,null,"Assessment details",null,null,null,"Irregular Words\n(/54)","Letter Sounds\n(/61)","*Letter Names\n(/52)",null,"Phoneme Segmentation",null,null,null,null,null,null,null,null,null,null,"Phoneme Blending",null,null,null,null,null,"*First Sounds",null,null,null,null,null,null,null,null,null,null,"*Continuous Blending",null,null,null,null,null,null,"Phoneme \nDeletion","Phoneme \nAddition","Phoneme \nSubstitution",null,"Closed Syllables","Vowel- \nConsonant -E    .","Basic Affixes",null,"Vowel Teams",null,"Vowel-R-Controlled",null,"Advanced Affixes",null,"Decoding Total Targets^ (not benchmarked)",null,null,null,null,null,null,null,"Irregular \nWords","Letter \nSounds","Letter \nNames",null,"Phoneme \nDeletion","Phoneme \nAddition","Phoneme \nSubstitution",null,"Closed Syllables","Vowel- \nConsonant -E","Basic Affixes","Vowel Teams","Vowel-R -Controlled","Advances Affixes"]
[null,"First Name","Last Name","Year\ngroup^","Class","Optional other details \n(e.g. EALD. Intervention)","Test type done\nBenchmark (BM) or Progress Monitoring (PM)?","Date of Assessment","Comments","Test Used^",null,null,null,null,"CV \n(max. score of 2 sounds)",null,"CVC\n(max. score of 3 sounds)",null,null,null,"CVCC  (max. of 4)","CCVC\n(max. score of 4 sounds)",null,"CVCC  (max. of 4)","Phoneme Segmentation Total^ \n(/32 sounds)","CVC","CCV","CVC","CCVC","Two Syllables","Phoneme Blending Total^  \n(/5)","CVC",null,null,null,null,null,"CVCC",null,"CCVC",null,"First Sounds Total^ \n(/20)","CVC ",null,null,null,"CCV ","Continuous Blending Total (/10)",null,null,null,null,null,null,null,null,null,null,null,null,null,null,null,null,null,null,"Phoneme Segmentation Total^","Phoneme Blending Total^","First Sounds Total^","Continuous Blending Total"]
["#",null,null,null,null,null,null,null,null,null,null,null,null,null,"so","key","pain","dog","bought","gas","last","spice","blame","pest",null,"red","glue","soap","brad","chapter",null,"boat","jet","cut","rot","net","pail","last","dump","stop","grub",null,"ran","sin","moose","main","snow",null,null,null,null,null,null,null,null,"Whole word","Correct Targets","Whole word","Correct Targets","Whole word","Correct Targets","Whole word","Correct Targets",null,null,null,null,null,null,null,null,null,null,null,null,null,null,null,null,null,null,"Correct Targets","Correct Targets","Correct Targets","Correct Targets"]
["#","First Name","Last Name","Year group","Class","Optional other details","Test type done","Date of Assessment","Comments","Test Used^","Irregular Words","Letter Sounds","Letter Names",null,"so","key","pain","dog","bought","gas","last","spice","blame","pest","Phoneme Segmentation Total^","red","glue","soap","brad","chapter","Phoneme Blending Total^","boat","jet","cut","rot","net","pail","last","dump","stop","grub","First Sounds Total","ran","sin","moose","main","snow","Continuous Blending Total",null,"Phoneme Deletion","Phoneme Addition","Phoneme Substitution",null,"Closed Syllables","Vowel- \nConsonant -E","Basic Affixes - WC","Basic Affixes - CT","Vowel Teams - WC","Vowel Teams - CT","Vowel R-Controlled - WC","Vowel R-Controlled - CT","Advanced Affixes - WC","Advanced Affixes - CT","Decoding Total Targets"]
[1,null,null,{"$f":"IF(B8=\"\",\"\",$E$1)","v":""},null,null,{"$f":"IF(COUNTA(B8)=0,\"\",Dropdowns!$C$2)","v":""},null,null,{"$f":"IF(B8=\"\",\"\",IF(G8=\"PM\",\"\",$F$1))","v":""},null,null,null,null,null,null,null,null,null,null,null,null,null,null,{"$f":"IF(COUNTA(O8:X8)>0,SUM(O8:X8),\"\")","v":""},null,null,null,null,null,{"$f":"IF(COUNTA(Z8:AD8)>0,SUM(Z8:AD8),\"\")","v":""},null,null,null,null,null,null,null,null,null,null,{"$f":"IF(COUNTA(AF8:AO8)>0,SUM(AF8:AO8),\"\")","v":""},null,null,null,null,null,{"$f":"IF(COUNTA(AQ8:AU8)>0,SUM(AQ8:AU8),\"\")","v":""},null,null,null,null,null,null,null,null,null,null,null,null,null,null,null,{"$f":"IF(COUNTA(BB8:BK8)>1,SUM(BB8,BC8,BE8,BG8,BI8,BK8),\"\")","v":""}]
{"$rows_left_out":128}
{"sheet":"Raw Scores-EOY","index":4,"n_rows":135,"n_cols":85,"rows_kept":135,"cut":false,"hidden":false,"merged":[[3,79,5,79],[3,80,5,80],[3,81,4,81],[3,82,4,82],[3,83,4,83],[2,71,2,73],[2,79,2,84],[1,66,1,84],[3,63,5,63],[2,53,2,63],[3,55,4,56],[3,54,5,54],[2,75,2,77],[3,71,5,71],[3,72,5,72],[3,73,5,73],[3,75,5,75],[3,76,5,76],[3,77,5,77],[3,84,4,84],[4,66,5,66],[4,4,5,4],[4,5,5,5],[132,14,133,23],[0,66,0,69],[2,66,2,69],[0,14,0,47],[4,24,5,24],[4,14,4,15],[4,16,4,19],[4,21,4,22],[2,49,2,51],[4,67,5,67],[4,68,5,68],[4,69,5,69],[4,7,5,7],[4,9,5,9],[0,0,0,2],[3,0,3,1],[3,6,3,9],[2,10,2,12],[3,14,3,24],[2,14,2,47],[3,31,3,41],[3,42,3,47],[3,12,5,12],[3,11,5,11],[3,10,5,10],[4,41,5,41],[4,47,5,47],[4,1,5,1],[4,2,5,2],[4,3,5,3],[4,6,5,6],[4,8,5,8],[3,25,3,30],[4,30,5,30],[3,59,4,60],[3,61,4,62],[4,42,4,45],[4,31,4,36],[4,37,4,38],[4,39,4,40],[3,49,5,49],[3,50,5,50],[3,51,5,51],[3,53,5,53],[3,57,4,58]]}
["Dynamic Decoding Measures-3 Scores",null,null,null,{"$f":"'Raw Scores-BOY'!E1","v":"PP"},"EOY"]
[null,null,null,null,null,null,null,null,null,null,null,null,null,null,null,null,null,null,null,null,null,null,null,null,"Totals not working? \nScroll to bottom…",null,null,null,null,null,"Total not working? Scroll to bottom…",null,null,null,null,null,null,null,null,null,null,"Total not working? Scroll to bottom…",null,null,null,null,null,"Total not working? Scroll to bottom…",null,null,null,null,null,null,null,null,null,null,null,null,null,null,null,"Total not working? Scroll to bottom…",null,null,"Interpretations Summary"]
[null,null,null,null,null,null,null,null,null,null,"OM - Orthographic Mapping",null,null,null,"Phonemic Awareness",null,null,null,null,null,null,null,null,null,null,null,null,null,null,null,null,null,null,null,null,null,null,null,null,null,null,null,null,null,null,null,null,null,null,"Phoneme Manipulation",null,null,null,"Decoding Inventory",null,null,null,null,null,null,null,null,null,null,null,null,"Phonemic Awareness",null,null,null,null,"Orthographic Mapping",null,null,null,"Phoneme Manipulation",null,null,null,"Decoding Inventory"]
[null,null,"Student Details",null,null,null,"Assessment details",null,null,null,"Irregular Words\n(/54)","Letter Sounds\n(/61)","*Letter Names\n(/52)",null,"Phoneme Segmentation",null,null,null,null,null,null,null,null,null,null,"Phoneme Blending",null,null,null,null,null,"*First Sounds",null,null,null,null,null,null,null,null,null,null,"*Continuous Blending",null,null,null,null,null,null,"Phoneme Deletion\n(/5)","Phoneme Addition\n(/5)","Phoneme Substitution\n(/5)",null,"Closed Syllables","Vowel- \nConsonant -E","Basic Affixes",null,"Vowel Teams",null,"Vowel-R-Controlled",null,"Advanced Affixes",null,"Decoding Total Targets^ (not benchmarked)",null,null,null,null,null,null,null,"Irregular \nWords","Letter \nSounds","Letter \nNames",null,"Phoneme \nDeletion","Phoneme \nAddition","Phoneme \nSubstitution",null,"Closed Syllables","Vowel- \nConsonant -E","Basic Affixes","Vowel Teams","Vowel-R -Controlled","Advances Affixes"]
[null,"First Name","Last Name","Year\ngroup^","Class","Optional other details \n(e.g. EALD. Intervention)","Test type done\nBenchmark (BM) or Progress Monitoring (PM)?","Date of Assessment","Comments","Test Used^",null,null,null,null,"CV \n(max. score of 2 sounds)",null,"CVC\n(max. score of 3 sounds)",null,null,null,"CVCC  (max. of 4)","CCVC\n(max. score of 4 sounds)",null,"CVCC  (max. of 4)","Phoneme Segmentation Total^ \n(/32 sounds)","CVC","CCV","CVC","CCVC","Two Syllables","Phoneme Blending Total^  \n(/5)","CVC",null,null,null,null,null,"CVCC",null,"CCVC",null,"First Sounds Total^ \n(/20)","CVC ",null,null,null,"CCV ","Continuous Blending Total (/10)",null,null,null,null,null,null,null,null,null,null,null,null,null,null,null,null,null,null,"Phoneme Segmentation Total^","Phoneme Blending Total^","First Sounds Total^","Continuous Blending Total"]
["#",null,null,null,null,null,null,null,null,null,null,null,null,null,"so","key","pain","dog","bought","gas","last","spice","blame","pest",null,"red","glue","soap","brad","chapter",null,"boat","jet","cut","rot","net","pail","last","dump","stop","grub",null,"ran","sin","moose","main","snow",null,null,null,null,null,null,null,null,"Whole word","Correct Targets","Whole word","Correct Targets","Whole word","Correct Targets","Whole word","Correct Targets",null,null,null,null,null,null,null,null,null,null,null,null,null,null,null,null,null,null,"Correct Targets","Correct Targets","Correct Targets","Correct Targets"]
["#","First Name","Last Name","Year group","Class","Optional other details","Test type done","Date of Assessment","Comments","Test Used^","Irregular Words","Letter Sounds","Letter Names",null,"so","key","pain","dog","bought","gas","last","spice","blame","pest","Phoneme Segmentation Total^","red","glue","soap","brad","chapter","Phoneme Blending Total^","boat","jet","cut","rot","net","pail","last","dump","stop","grub","First Sounds Total","ran","sin","moose","main","snow","Continuous Blending Total",null,"Phoneme Deletion","Phoneme Addition","Phoneme Substitution",null,"Closed Syllables","Vowel- \nConsonant -E","Basic Affixes - WC","Basic Affixes - CT","Vowel Teams - WC","Vowel Teams - CT","Vowel R-Controlled - WC","Vowel R-Controlled - CT","Advanced Affixes - WC","Advanced Affixes - CT","Decoding Total Targets"]
[1,null,null,{"$f":"IF(B8=\"\",\"\",$E$1)","v":""},null,null,{"$f":"IF(COUNTA(B8)=0,\"\",Dropdowns!$C$2)","v":""},null,null,{"$f":"IF(B8=\"\",\"\",IF(G8=\"PM\",\"\",$F$1))","v":""},null,null,null,null,null,null,null,null,null,null,null,null,null,null,{"$f":"IF(COUNTA(O8:X8)>0,SUM(O8:X8),\"\")","v":""},null,null,null,null,null,{"$f":"IF(COUNTA(Z8:AD8)>0,SUM(Z8:AD8),\"\")","v":""},null,null,null,null,null,null,null,null,null,null,{"$f":"IF(COUNTA(AF8:AO8)>0,SUM(AF8:AO8),\"\")","v":""},null,null,null,null,null,{"$f":"IF(COUNTA(AQ8:AU8)>0,SUM(AQ8:AU8),\"\")","v":""},null,null,null,null,null,null,null,null,null,null,null,null,null,null,null,{"$f":"IF(COUNTA(BB8:BK8)>1,SUM(BB8,BC8,BE8,BG8,BI8,BK8),\"\")","v":""}]
{"$rows_left_out":128}
{"sheet":"Benchmark Scores","index":5,"n_rows":29,"n_cols":33,"rows_kept":29,"cut":false,"hidden":true,"merged":[[9,0,9,24],[0,0,1,0],[1,21,1,22],[1,23,1,24],[1,11,1,12],[1,13,1,14],[1,15,1,16],[1,17,1,18],[1,19,1,20],[1,1,1,2],[1,3,1,4],[1,5,1,6],[1,7,1,8],[1,9,1,10],[1,26,1,32],[21,0,21,24],[22,1,22,8],[22,9,22,16],[22,17,22,24],[10,1,10,8],[10,9,10,16],[10,17,10,24],[15,0,15,24],[16,1,16,8],[16,9,16,16],[16,17,16,24],[3,17,3,24],[2,0,2,24],[3,1,3,8],[3,9,3,16]]}
["PP DDM-3 Benchmarks"]
[null,"Significant Risk",null,"Moderate Risk",null,"Benchmark",null,"Advanced",null,"Significant Risk",null,"Moderate Risk",null,"Benchmark",null,"Advanced",null,"Significant Risk",null,"Moderate Risk",null,"Benchmark",null,"Advanced",null,null,"Number of points"]
["Phonemic Awareness",null,null,null,null,null,null,null,null,null,null,null,null,null,null,null,null,null,null,null,null,null,null,null,null,null,"Subtest out of",{"$f":"Dropdowns!$L$4","v":0},{"$f":"Dropdowns!$M$4","v":0.25},{"$f":"Dropdowns!$N$4","v":0.26},{"$f":"Dropdowns!$O$4","v":0.75},{"$f":"Dropdowns!$P$4","v":0.76},{"$f":"Dropdowns!$Q$4","v":1}]
[null,"BOY",null,null,null,null,null,null,null,"MOY",null,null,null,null,null,null,null,"EOY"]
["Phoneme Segmentation",0,1,2,13,14,27,28,32,0,19,20,26,27,30,31,32,0,26,27,28,29,32,"-","-"]
["Phoneme Blending ","-","-","-","-","-","-","-","-",0,2,3,3,4,4,5,5,0,2,3,3,4,4,5,5,"Use for BOY only",20,{"$f":"$AA6*AB$3","v":0},5,5.2,15,15.2,20]
["First Sounds",0,9,10,15,16,18,19,20,0,15,16,18,19,19,20,20,0,16,17,18,19,19,20,20]
["Continuous Blending",0,2,3,6,7,9,10,10,0,8,9,9,10,10,"-","-",0,9,"-","-",10,10,"-","-"]
{"$rows_left_out":22}
{"sheet":"Dropdowns","index":6,"n_rows":11,"n_cols":17,"rows_kept":11,"cut":false,"hidden":true,"merged":[[2,10,4,10]]}
["Scores",null,"Test Types",null,"Grades",null,"Timepoint",null,"Risk Categories",null,"Spreadsheet version: v1.1"]
[null,null,"BM",null,"Kindy",null,"BOY",null,"Advanced"]
[0,null,"PM",null,"PP",null,"MOY",null,"Benchmark",null,"Percentage bands used:"]
[1,null,null,null,"Year 1",null,"EOY",null,"Moderate Risk",null,null,0,0.25,0.26,0.75,0.76,1]
[2,null,null,null,"Year 2",null,null,null,"Significant Risk"]
[3,null,null,null,"Year 3"]
[4,null,null,null,"Year 4"]
[null,null,null,null,"Year 5"]
{"$rows_left_out":3}